BDBM49271 4-[4-(5-methyl-1,2,4-oxadiazol-3-yl)phenoxy]phenyl acetate::MLS000088194::SMR000072432::[4-[4-(5-methyl-1,2,4-oxadiazol-3-yl)phenoxy]phenyl] acetate::[4-[4-(5-methyl-1,2,4-oxadiazol-3-yl)phenoxy]phenyl] ethanoate::acetic acid [4-[4-(5-methyl-1,2,4-oxadiazol-3-yl)phenoxy]phenyl] ester::cid_889672
SMILES CC(=O)Oc1ccc(Oc2ccc(cc2)-c2noc(C)n2)cc1
InChI Key InChIKey=XXPNHKCKRZHLRE-UHFFFAOYSA-N
Data  1 EC50
  Tab Delimited (TSV)   2D SDfile   Computed 3D by Vconf -m prep SDfile
Find this compound or compounds like it in BindingDB:
Activity Spreadsheet -- Enzyme Inhibition Constant Data from BindingDB
Found 1 hit for monomerid = 49271
TargetTranscription factor p65(Homo sapiens (Human))
Srmlsc
Curated by PubChem BioAssay
LigandPNGBDBM49271(4-[4-(5-methyl-1,2,4-oxadiazol-3-yl)phenoxy]phenyl...)
Affinity DataEC50:  2.84E+3nM. Assay description: Southern Research Molecular Libraries Screening Center (SRMLSC) Southern Research Institute (Birmingham, Alabama) NIH Molecular Libraries Screening C...
In DepthDetails PCBioAssay